{"text_format":"1","workbook":"xlsx","n_sheets":5,"sheets":["Order Template","LH Cutting List","RH Cutting List","Order Template Info","Template Information"],"not_rendered":{"charts":0,"images":8,"macros":1,"external_links":2,"defined_names":29,"comments":0,"pivot_tables":0},"unopened":[],"bounds":{"document_bytes":16777216,"sheet_cells":100000,"rows_first":2000,"rows_last":500,"rows_between":2000,"halvings":0,"cell_chars":16384,"cell_head_chars":4096},"cells_cut":0,"cells_raw":0,"read":"whole","date_system":"1900"}

{"sheet":"Order Template","index":0,"n_rows":43,"n_cols":33,"rows_kept":43,"cut":false,"hidden":false,"merged":[[41,1,42,2],[41,5,42,5],[41,21,42,23],[41,3,42,4],[11,29,11,34],[12,29,12,34],[13,29,13,34],[41,9,41,20],[42,9,42,20],[16,25,16,27],[15,22,15,23],[16,22,16,23],[41,30,42,32],[41,6,41,8],[42,6,42,8],[37,24,37,29],[3,1,6,5],[11,24,11,28],[12,24,12,28],[13,24,13,28],[3,6,6,31],[8,24,9,34],[10,29,10,34],[10,24,10,28],[41,24,42,29],[41,33,42,36],[15,32,15,34],[16,32,16,34],[15,25,15,27],[38,24,38,29],[37,30,37,34],[38,30,38,34],[33,24,34,34],[35,24,35,29],[35,30,35,34]]}
[]
[]
[]
[null,"360001",null,null,null,null,"Order Template - Optima 36 Door"]
[]
[]
[]
[]
[null,null,null,null,null,null,null,null,null,null,null,null,null,null,null,null,null,null,null,null,null,null,null,null,"Door Type Pick List"]
[]
[null,null,null,null,null,null,null,null,null,null,null,null,null,null,null,null,null,null,null,null,null,null,null,null,"Option Type",null,null,null,null,"Variables"]
[null,null,null,null,null,null,null,null,null,null,null,null,null,null,null,null,null,null,null,null,null,null,null,null,"Locking?"]
[null,null,null,null,null,null,null,null,null,null,null,null,null,null,null,null,null,null,null,null,null,null,null,null,"Closer?"]
[]
[]
[null,null,null,null,null,null,null,null,null,null,null,null,null,null,null,null,null,null,null,null,null,null,"Left Hand Qty",null,null,"Code:",null,null,1,{"$f":"IF(AD12='Order Template Info'!H9,3,1)","v":1},0,{"$f":"IF(AD13='Order Template Info'!N7,1,2)","v":2},"0 8 3 0 0 0 6 5"]
[null,null,null,null,null,null,null,null,null,null,null,null,null,null,null,null,null,null,null,null,null,null,"Right Hand Qty",null,null,"Code:",null,null,2,{"$f":"IF(AD12='Order Template Info'!H9,3,1)","v":1},0,{"$f":"IF(AD13='Order Template Info'!N7,1,2)","v":2},"0 8 3 0 0 0 6 5"]
[]
[]
[]
[]
[]
[]
[]
[]
[]
[]
[]
[]
[]
[]
[]
[]
[null,null,null,null,null,null,null,null,null,null,null,null,null,null,null,null,null,null,null,null,null,null,null,null,"Recommended Glass Size"]
[]
[null,null,null,null,null,null,null,null,null,null,null,null,null,null,null,null,null,null,null,null,null,null,null,null,"Glass Edge",null,null,null,null,null,"Recommended Size"]
[]
[null,null,null,null,null,null,null,null,null,null,null,null,null,null,null,null,null,null,null,null,null,null,null,null,"Door Glass Height",null,null,null,null,null,"Door Height - 172mm"]
[null,null,null,null,null,null,null,null,null,null,null,null,null,null,null,null,null,null,null,null,null,null,null,null,"Door Glass Width",null,null,null,null,null,"791mm"]
[]
[]
[null,null,null,"Revision",null,"C","Client Name",null,null,null,null,null,null,null,null,null,null,null,null,null,null,"Client Order No.",null,null,null,null,null,null,null,null,"OP Sales Order No."]
[null,null,null,null,null,null,"Project Name"]

{"sheet":"LH Cutting List","index":1,"n_rows":50,"n_cols":18,"rows_kept":50,"cut":false,"hidden":false,"merged":[[2,1,3,4],[2,5,3,6],[2,8,2,9],[3,8,6,9],[4,1,8,6],[7,8,8,9],[11,1,12,9],[13,1,15,2],[13,3,15,4],[13,5,15,5],[13,6,15,8],[13,9,15,9],[18,1,19,2],[18,3,19,4],[18,5,19,5],[18,6,19,8],[18,9,19,9],[16,1,17,2],[16,3,17,4],[16,5,17,5],[16,6,17,8],[16,9,17,9],[28,1,29,9],[20,1,21,2],[20,3,21,4],[20,5,21,5],[20,6,21,8],[20,9,21,9],[22,1,23,2],[22,3,23,4],[22,5,23,5],[22,6,23,8],[22,9,23,9],[24,1,25,2],[24,3,25,4],[24,5,25,5],[24,6,25,8],[24,9,25,9],[33,1,34,2],[33,3,34,4],[33,5,34,5],[33,6,34,8],[33,9,34,9],[30,1,32,2],[30,3,32,4],[30,5,32,5],[30,6,32,8],[30,9,32,9],[37,1,38,2],[37,3,38,4],[37,5,38,5],[37,6,38,8],[37,9,38,9],[35,1,36,2],[35,3,36,4],[35,5,36,5],[35,6,36,8],[35,9,36,9],[41,1,44,9],[47,1,48,3],[47,4,48,6],[47,7,48,9],[49,1,50,3],[49,4,50,6],[49,7,50,9]]}
[]
[]
[null,{"$f":"'Order Template'!$J$43","v":0},null,null,null,{"$f":"\"Qty: \"&'Order Template'!$Y$16 & \" No.\"","v":"Qty:  No."},null,null,"Natural Anodise"]
[null,null,null,null,null,null,null,null,"SAA"]
[null,{"$f":"\"Left Hand\"&\" Single Glazed Optima 36 Door with \" & 'Order Template'!$AD$12","v":"Left Hand Single Glazed Optima 36 Door with "}]
[]
[null,null,null,null,null,null,null,null,null,null,null,null,null,null,null,null,null,{"$f":"X12&\" \"&X11","v":" "}]
[null,null,null,null,null,null,null,null,"Standard"]
[]
[]
[]
[null,"Door Cutting List"]
[]
[null,"Type",null,"Drawing Reference",null,"Cut Length","Description",null,null,"Quantity"]
[]
[]
[null,"Head Rail",null,{"$f":"'Template Information'!$Q$19","v":"0503-001 (C)"},null,763,{"$f":"'Template Information'!$S$19","v":"LH ITS96 Closer Head"},null,null,{"$f":"$F$3","v":"Qty:  No."}]
[]
[null,"Leading Stile",null,{"$f":"'Template Information'!$Q$20","v":"0502-007 (B)"},null,3000,{"$f":"'Template Information'!$S$20","v":"LH Sash-Lock Leading Stile"},null,null,{"$f":"$F$3","v":"Qty:  No."}]
[]
[null,"Back Stile",null,{"$f":" 'Template Information'!$Q$21","v":"0502-001 (B)"},null,3000,{"$f":"'Template Information'!$S$21","v":"LH Back Stile"},null,null,{"$f":"$F$3","v":"Qty:  No."}]
[]
[null,"Base Rail",null,{"$f":" 'Template Information'!$Q$22","v":"0503-003 (C)"},null,763,{"$f":"'Template Information'!$S$22","v":"Plain Head/Base Rail"},null,null,{"$f":"$F$3","v":"Qty:  No."}]
[]
[null,{"$f":"IF('Order Template'!$AD$13=\"No Closer\",\"Door Head Cap\",\" \")","v":" "},null,{"$f":"IF('Order Template'!$AD$13=\"No Closer\",\"0510-001 (B)\",\" \")","v":" "},null,{"$f":"IF('Order Template'!$AD$13=\"No Closer\",\"913mm\",\" \")","v":" "},{"$f":"IF('Order Template'!$AD$13=\"No Closer\",\"Door Cap\",\" \")","v":" "},null,null,{"$f":"IF('Order Template'!$AD$13=\"No Closer\",J17,\" \")","v":" "}]
[]
[]
[]
[]
[]
[]
[]
[]
[]
[]
[]
[]
[]
[]
[]
[]
[null,{"$f":"'Order Template'!$AC$16&\" \"&'Order Template'!$AD$16&\" \"&'Order Template'!$AE$16&\" \"&'Order Template'!AF16&\" \"&'Order Template'!$AG$16","v":"1 1 0 2 0 8 3 0 0 0 6 5"}]
[]
[]
[]
[]
[]
[null,"Sales Order No.",null,null,"Client Name",null,null,"Client Order No."]
[]
[null,{"$f":"'Order Template'!$AH$42","v":0},null,null,{"$f":"'Order Template'!$J$42","v":0},null,null,{"$f":"'Order Template'!$Y$42","v":0}]

{"sheet":"RH Cutting List","index":2,"n_rows":50,"n_cols":18,"rows_kept":50,"cut":false,"hidden":false,"merged":[[2,1,3,4],[2,5,3,6],[2,8,2,9],[3,8,6,9],[4,1,8,6],[7,8,8,9],[11,1,12,9],[13,1,15,2],[13,3,15,4],[13,5,15,5],[13,6,15,8],[13,9,15,9],[18,1,19,2],[18,3,19,4],[18,5,19,5],[18,6,19,8],[18,9,19,9],[16,1,17,2],[16,3,17,4],[16,5,17,5],[16,6,17,8],[16,9,17,9],[28,1,29,9],[20,1,21,2],[20,3,21,4],[20,5,21,5],[20,6,21,8],[20,9,21,9],[22,1,23,2],[22,3,23,4],[22,5,23,5],[22,6,23,8],[22,9,23,9],[24,1,25,2],[24,3,25,4],[24,5,25,5],[24,6,25,8],[24,9,25,9],[33,1,34,2],[33,3,34,4],[33,5,34,5],[33,6,34,8],[33,9,34,9],[30,1,32,2],[30,3,32,4],[30,5,32,5],[30,6,32,8],[30,9,32,9],[37,1,38,2],[37,3,38,4],[37,5,38,5],[37,6,38,8],[37,9,38,9],[35,1,36,2],[35,3,36,4],[35,5,36,5],[35,6,36,8],[35,9,36,9],[41,1,44,9],[47,1,48,3],[47,4,48,6],[47,7,48,9],[49,1,50,3],[49,4,50,6],[49,7,50,9]]}
[]
[]
[null,{"$f":"'Order Template'!$J$43","v":0},null,null,null,{"$f":"\"Qty: \"&'Order Template'!$Y$17 & \" No.\"","v":"Qty:  No."},null,null,"Natural Anodise"]
[null,null,null,null,null,null,null,null,"SAA"]
[null,{"$f":"\"Right Hand\"&\" Single Glazed Optima 36 Door with \" & 'Order Template'!$AD$12","v":"Right Hand Single Glazed Optima 36 Door with "}]
[]
[null,null,null,null,null,null,null,null,null,null,null,null,null,null,null,null,null,{"$f":"X12&\" \"&X11","v":" "}]
[null,null,null,null,null,null,null,null,"Standard"]
[]
[]
[]
[null,"Door Cutting List"]
[]
[null,"Type",null,"Drawing Reference",null,"Cut Length","Description",null,null,"Quantity"]
[]
[]
[null,"Head Rail",null,{"$f":"'Template Information'!$Q$68","v":"0503-002 (C)"},null,763,{"$f":"'Template Information'!$S$68","v":"RH ITS96 Closer Head"},null,null,{"$f":"$F$3","v":"Qty:  No."}]
[]
[null,"Leading Stile",null,{"$f":" 'Template Information'!$Q$69","v":"0502-008 (B)"},null,3000,{"$f":"'Template Information'!$S$69","v":"RH Sash-Lock Leading Stile"},null,null,{"$f":"$F$3","v":"Qty:  No."}]
[]
[null,"Back Stile",null,{"$f":"'Template Information'!$Q$70","v":"0502-002 (B)"},null,3000,{"$f":"'Template Information'!$S$70","v":"RH Back Stile"},null,null,{"$f":"$F$3","v":"Qty:  No."}]
[]
[null,"Base Rail",null,{"$f":" 'Template Information'!$Q$71","v":"0503-003 (C)"},null,763,{"$f":"'Template Information'!$S$71","v":"Plain Head/Base Rail"},null,null,{"$f":"$F$3","v":"Qty:  No."}]
[]
[null,{"$f":"IF('Order Template'!$AD$13=\"No Closer\",\"Door Head Cap\",\" \")","v":" "},null,{"$f":"IF('Order Template'!$AD$13=\"No Closer\",\"0510-001 (B)\",\" \")","v":" "},null,{"$f":"IF('Order Template'!$AD$13=\"No Closer\",\"913mm\",\" \")","v":" "},{"$f":"IF('Order Template'!$AD$13=\"No Closer\",\"Door Cap\",\" \")","v":" "},null,null,{"$f":"IF('Order Template'!$AD$13=\"No Closer\",J17,\" \")","v":" "}]
[]
[]
[]
[]
[]
[]
[]
[]
[]
[]
[]
[]
[]
[]
[]
[]
[null,{"$f":"'Order Template'!$AC$17&\" \"&'Order Template'!$AD$16&\" \"&'Order Template'!$AE$16&\" \"&'Order Template'!AF16&\" \"&'Order Template'!$AG$16","v":"2 1 0 2 0 8 3 0 0 0 6 5"}]
[]
[]
[]
[]
[]
[null,"Sales Order No.",null,null,"Client Name",null,null,"Client Order No."]
[]
[null,{"$f":"'Order Template'!$AH$42","v":0},null,null,{"$f":"'Order Template'!$J$42","v":0},null,null,{"$f":"'Order Template'!$Y$42","v":0}]

{"sheet":"Order Template Info","index":3,"n_rows":9,"n_cols":14,"rows_kept":9,"cut":false,"hidden":true,"merged":[]}
[]
[]
[]
[]
[]
[]
[null,null,null,"Left Hand",null,null,null,null,null,null,"10mm",null,null,"No Closer"]
[null,null,null,"Right Hand",null,null,null,"Pull Handles Only",null,null,"12.0mm",null,null,"Concealed Closer"]
[null,null,null,null,null,null,null,"Sash Lock"]

{"sheet":"Template Information","index":4,"n_rows":74,"n_cols":23,"rows_kept":74,"cut":false,"hidden":true,"merged":[[8,18,9,19],[2,1,5,5],[8,1,9,5],[8,7,9,11],[8,13,9,16],[8,17,9,17],[10,18,17,19],[11,1,11,5],[11,7,11,11],[12,1,12,5],[12,13,13,14],[10,1,10,5],[10,7,10,11],[10,13,11,14],[10,15,11,15],[10,16,11,17],[18,13,21,14],[18,16,18,17],[12,15,13,15],[12,16,13,17],[13,1,13,5],[14,13,15,14],[14,15,15,15],[14,16,15,17],[16,1,17,5],[16,7,17,11],[16,13,17,14],[16,15,17,15],[16,16,17,17],[24,1,27,5],[24,16,24,17],[24,18,24,19],[25,13,25,17],[18,18,18,19],[19,7,19,11],[19,16,19,17],[19,18,19,19],[20,1,21,5],[20,7,20,11],[20,16,20,17],[20,18,20,19],[21,16,21,17],[21,18,21,19],[18,1,19,5],[18,7,18,11],[22,13,24,14],[22,16,22,17],[22,18,22,19],[23,16,23,17],[23,18,23,19],[30,1,43,5],[30,7,31,11],[30,13,31,17],[30,18,43,19],[32,8,32,11],[38,7,39,11],[40,8,40,11],[41,8,41,11],[42,7,43,11],[59,3,59,4],[48,3,48,4],[49,3,49,4],[50,3,50,4],[51,3,51,4],[52,3,52,4],[53,3,53,4],[54,3,54,4],[55,3,55,4],[56,3,56,4],[57,3,57,4],[58,3,58,4],[60,3,60,4],[67,13,70,14],[67,16,67,17],[67,18,67,19],[68,16,68,17],[68,18,68,19],[69,16,69,17],[69,18,69,19],[70,16,70,17],[70,18,70,19],[71,13,73,14],[71,16,71,17],[71,18,71,19],[72,16,72,17],[72,18,72,19],[73,16,73,17],[73,18,73,19]]}
[]
[]
[null,"General Information"]
[null,null,null,null,null,null,null,null,null,null,null,null,null,null,null,null,{"$f":"IF('Order Template'!AD16=\"Pull Handles Only\",1,2)","v":2}]
[]
[]
[]
[null,null,null,null,null,null,null,null,null,null,null,null,null,null,null,null,null,{"$f":"SUM(200,P13,P15)","v":212}]
[null,"Lock Type",null,null,null,null,null,"Handing",null,null,null,null,null,"Results",null,null,null,{"$f":"SUM(100,P13,P15)","v":112}]
[]
[null,"Pull Handles Only",null,null,null,null,null,"Left Hand"]
[null,"Sash-Lock",null,null,null,null,null,"Right Hand"]
[null,null,null,null,null,null,null,null,null,null,null,null,null,"Lock Form",null,{"$f":"IF('Order Template'!$AD$12=\"Pull Handles Only\",1,2)","v":2},{"$f":"IF($P$13=1,B11,IF($P$13=2,B12,B13))","v":"Sash-Lock"}]
[]
[null,null,null,null,null,null,null,null,null,null,null,null,null,"Closer",null,{"$f":"IF($Q$15=2,10,0)","v":10},{"$f":"'Order Template'!AF16","v":2}]
[]
[null,"Concealed Closer?",null,null,null,null,null,"Door Information",null,null,null,null,null,"Finish",null,2,"08"]
[]
[null,"Yes",null,null,null,null,null,{"$f":"(Q11&\" \"&\"Single Glazed Optima 36 Door with\"&\" \"&B11)","v":" Single Glazed Optima 36 Door with Pull Handles Only"},null,null,null,null,null,"Left Variable Drawings (Door)",null,"Head",{"$f":"VLOOKUP($R$9,$B$49:$M$61,5,FALSE)","v":"0503-001 (C)"},null,{"$f":"VLOOKUP($R$9,$B$49:$Q$61,6,FALSE)","v":"LH ITS96 Closer Head"}]
[null,null,null,null,null,null,null,{"$f":"(Q11&\" \"&\"Single Glazed Optima 36 Door with\"&\" \"&B12)","v":" Single Glazed Optima 36 Door with Sash-Lock"},null,null,null,null,null,null,null,"Lead",{"$f":"VLOOKUP(R9,B49:M61,9,FALSE)","v":"0502-007 (B)"},null,{"$f":"VLOOKUP($R$9,$B$49:$M$61,10,FALSE)","v":"LH Sash-Lock Leading Stile"}]
[null,"No",null,null,null,null,null,{"$f":"(Q11&\" \"&\"Single Glazed Optima 36 Door with\"&\" \"&B13)","v":" Single Glazed Optima 36 Door with "},null,null,null,null,null,null,null,"Back",{"$f":"VLOOKUP(R9,B49:M61,11,FALSE)","v":"0502-001 (B)"},null,{"$f":"VLOOKUP($R$9,$B$49:$M$61,12,FALSE)","v":"LH Back Stile"}]
[null,null,null,null,null,null,null,null,null,null,null,null,null,null,null,"Base",{"$f":"VLOOKUP(R9,B49:M61,7,FALSE)","v":"0503-003 (C)"},null,{"$f":"VLOOKUP($R$9,$B$49:$M$61,8,FALSE)","v":"Plain Head/Base Rail"}]
[null,null,null,null,null,null,null,null,null,null,null,null,null,"Left Variable Drawings (Frame)",null,"Head",{"$f":"VLOOKUP($R$9,$B$49:$P$61,15,FALSE)","v":"0508-003 (B)"},null,{"$f":"VLOOKUP($R$9,$B$49:$Q$61,16,FALSE)","v":"LH ITS96 Closer Head"},null,null,null,{"$f":"IF('Template Information'!$P$13=1,'Template Information'!$W$47,IF('Template Information'!$P$13=3,'Template Information'!$X$47,'Template Information'!$Y$47))","v":0}]
[null,null,null,null,null,null,null,null,null,null,null,null,null,null,null,"Slam",{"$f":"VLOOKUP($R$9,$B$49:$P$61,14,FALSE)","v":"0500-002 (B)"},null,{"$f":"IF(S21=\"bespoke\",\"Bespoke\",\"RH Plain Jamb\")","v":"RH Plain Jamb"}]
[null,"Drawings",null,null,null,null,null,null,null,null,null,null,null,null,null,"Hinge",{"$f":"VLOOKUP($R$9,$B$49:$P$61,13,FALSE)","v":"0500-001 (B)"},null,{"$f":"IF(S21=\"bespoke\",\"Bespoke\",\"LH Plain Jamb\")","v":"LH Plain Jamb"}]
[]
[]
[]
[]
[null,null,null,null,null,null,null,null,null,null,null,null,null,null,{"$f":"VLOOKUP($R$9,$N$33:$O$40,2,FALSE)","v":{"$error":"#N/A"}}]
[null,null,null,null,null,null,null,"Base Rail",null,null,null,null,null,"Door Codes"]
[]
[null,null,null,null,null,null,null,"0503-003","Plain Head/Base Rail",null,null,null,null,101,1101]
[null,null,null,null,null,null,null,null,null,null,null,null,null,111,1102]
[null,null,null,null,null,null,null,null,null,null,null,null,null,103,1301]
[null,null,null,null,null,null,null,null,null,null,null,null,null,113,1302]
[null,null,null,null,null,null,null,null,null,null,null,null,null,201,2101]
[null,null,null,null,null,null,null,null,null,null,null,null,null,211,2102]
[null,null,null,null,null,null,null,"Back Stile",null,null,null,null,null,203,2301]
[null,null,null,null,null,null,null,null,null,null,null,null,null,213,2302]
[null,null,null,null,null,null,null,"0502-001","LH Back Stile"]
[null,null,null,null,null,null,null,"0502-002","RH Back Stile"]
[]
[]
[]
[]
[]
[null,1,2,3,4,5,6,7,8,9,10,11,12,13,14,15]
[null,"Value","HANDING","Door Type",null,"Head","H-Desc","Base","B-Desc","L-Lead","L-Desc","Back","Ba-Desc","Frame Slam","Frame Hinge","Frame Head ","F-Head Desc"]
[null,101,"LH","No Closer Plain",null,"0503-003 (C)","Plain Head/Base Rail","0503-003 (C)","Plain Head/Base Rail","0502-003 (B)","LH Plain Leading Stile","0502-001 (B)","LH Back Stile","0500-001 (B)","0500-002 (B)","0508-001 (B)","Plain Frame Head"]
[null,102,"LH","No Closer Sash-Lock",null,"0503-003 (C)","Plain Head/Base Rail","0503-003 (C)","Plain Head/Base Rail","0502-007 (B)","LH Sash-Lock Leading Stile","0502-001 (B)","LH Back Stile","0500-001 (B)","0500-002 (B)","0508-001 (B)","Plain Frame Head"]
[null,111,"LH","Closer Plain",null,"0503-001 (C)","LH ITS96 Closer Head","0503-003 (C)","Plain Head/Base Rail","0502-003 (B)","LH Plain Leading Stile","0502-001 (B)","LH Back Stile","0500-001 (B)","0500-002 (B)","0508-003 (B)","LH ITS96 Closer Head"]
[null,112,"LH","Closer Sash-Lock",null,"0503-001 (C)","LH ITS96 Closer Head","0503-003 (C)","Plain Head/Base Rail","0502-007 (B)","LH Sash-Lock Leading Stile","0502-001 (B)","LH Back Stile","0500-001 (B)","0500-002 (B)","0508-003 (B)","LH ITS96 Closer Head"]
[null,201,"RH","No Closer Plain",null,"0503-003 (C)","Plain Head/Base Rail","0503-003 (C)","Plain Head/Base Rail","0502-004 (B)","RH Plain Leading Stile","0502-002 (B)","RH Back Stile","0500-001 (B)","0500-002 (B)","0508-001 (B)","Plain Frame Head"]
[null,202,"RH","No Closer Sash-Lock",null,"0503-003 (C)","Plain Head/Base Rail","0503-003 (C)","Plain Head/Base Rail","0502-008 (B)","LH Sash-Lock Leading Stile","0502-002 (B)","RH Back Stile","0500-001 (B)","0500-002 (B)","0508-001 (B)","Plain Frame Head"]
[null,211,"RH","Closer Plain",null,"0503-002 (C)","RH ITS96 Closer Head","0503-003 (C)","Plain Head/Base Rail","0502-004 (B)","RH Plain Leading Stile","0502-002 (B)","RH Back Stile","0500-001 (B)","0500-002 (B)","0508-002 (B)","RH ITS96 Closer Head"]
[null,212,"RH","Closer Sash-Lock",null,"0503-002 (C)","RH ITS96 Closer Head","0503-003 (C)","Plain Head/Base Rail","0502-008 (B)","RH Sash-Lock Leading Stile","0502-002 (B)","RH Back Stile","0500-001 (B)","0500-002 (B)","0508-002 (B)","RH ITS96 Closer Head"]
[null,113,"LH","Closer Bespoke Lock",null,"Bespoke","Bespoke","Bespoke","Bespoke","Bespoke","Bespoke","Bespoke","Bespoke","Bespoke","Bespoke","Bespoke","Bespoke"]
[null,103,"LH","No Closer Bespoke Lock",null,"Bespoke","Bespoke","Bespoke","Bespoke","Bespoke","Bespoke","Bespoke","Bespoke","Bespoke","Bespoke","Bespoke","Bespoke"]
[null,213,"RH","Closer Bespoke Lock",null,"Bespoke","Bespoke","Bespoke","Bespoke","Bespoke","Bespoke","Bespoke","Bespoke","Bespoke","Bespoke","Bespoke","Bespoke"]
[null,203,"RH","No Closer Bespoke Lock",null,"Bespoke","Bespoke","Bespoke","Bespoke","Bespoke","Bespoke","Bespoke","Bespoke","Bespoke","Bespoke","Bespoke","Bespoke"]
[null,null,null,null,null,null," "]
[]
[]
[]
[]
[]
[null,null,null,null,null,null,null,null,null,null,null,null,null,"Left Variable Drawings (Door)",null,"Head",{"$f":"VLOOKUP($R$8,$B$49:$M$61,5,FALSE)","v":"0503-002 (C)"},null,{"$f":"VLOOKUP($R$8,$B$49:$Q$61,6,FALSE)","v":"RH ITS96 Closer Head"}]
[null,null,null,null,null,null,null,null,null,null,null,null,null,null,null,"Lead",{"$f":"VLOOKUP($R$8,B49:Q61,9,FALSE)","v":"0502-008 (B)"},null,{"$f":"VLOOKUP($R$8,$B$49:$M$61,10,FALSE)","v":"RH Sash-Lock Leading Stile"}]
[null,null,null,null,null,null,null,null,null,null,null,null,null,null,null,"Back",{"$f":"VLOOKUP($R$8,B49:Q61,11,FALSE)","v":"0502-002 (B)"},null,{"$f":"VLOOKUP($R$8,$B$49:$M$61,12,FALSE)","v":"RH Back Stile"}]
[null,null,null,null,null,null,null,null,null,null,null,null,null,null,null,"Base",{"$f":"VLOOKUP($R$8,B49:Q61:M110,7,FALSE)","v":"0503-003 (C)"},null,{"$f":"VLOOKUP($R$8,$B$49:$M$61,8,FALSE)","v":"Plain Head/Base Rail"}]
[null,null,null,null,null,null,null,null,null,null,null,null,null,"Left Variable Drawings (Frame)",null,"Head",{"$f":"VLOOKUP($R$8,$B$49:$Q$61,15,FALSE)","v":"0508-002 (B)"},null,{"$f":"VLOOKUP($R$8,$B$49:$Q$61,16,FALSE)","v":"RH ITS96 Closer Head"}]
[null,null,null,null,null,null,null,null,null,null,null,null,null,null,null,"Slam",{"$f":"VLOOKUP($R$8,$B$49:$P$61,14,FALSE)","v":"0500-002 (B)"},null,{"$f":"IF(S70=\"bespoke\",\"Bespoke\",\"LH Plain Jamb\")","v":"LH Plain Jamb"}]
[null,null,null,null,null,null,null,null,null,null,null,null,null,null,null,"Hinge",{"$f":"VLOOKUP($R$8,$B$49:$P$61,13,FALSE)","v":"0500-001 (B)"},null,{"$f":"IF(S70=\"bespoke\",\"Bespoke\",\"RH Plain Jamb\")","v":"RH Plain Jamb"}]