{"text_format":"1","workbook":"xlsx","n_sheets":12,"sheets":["Cover sheet","Frame","Door","Lookups","LH Door Glass Order Sheet","RH Door Glass Order Sheet","LH Cutting List","RH Cutting List","Frame Cutting List","Drawing Numbers","Images","Change record"],"not_rendered":{"charts":0,"images":20,"macros":1,"external_links":1,"defined_names":69,"comments":0,"pivot_tables":0},"unopened":[],"bounds":{"document_bytes":16777216,"sheet_cells":100000,"rows_first":2000,"rows_last":500,"rows_between":2000,"halvings":0,"cell_chars":16384,"cell_head_chars":4096},"cells_cut":0,"cells_raw":0,"read":"whole","date_system":"1900"}

{"sheet":"Cover sheet","index":0,"n_rows":106,"n_cols":16,"rows_kept":106,"cut":false,"hidden":false,"merged":[[43,18,44,20],[65,1,66,4],[65,5,66,5],[65,6,66,6],[65,7,66,7],[43,6,43,8],[43,0,44,1],[43,2,44,2],[43,3,44,3],[64,1,64,7],[43,12,44,14],[43,15,44,17],[44,6,44,8],[43,9,44,11],[37,1,37,5],[20,2,20,5],[20,6,20,7],[2,1,5,4],[2,5,3,16],[4,5,5,16],[16,2,16,7],[16,15,16,16],[18,13,18,14],[16,13,16,14],[18,15,18,16],[17,2,17,3],[17,5,17,6]]}
[]
[]
[null,100091,null,null,null,"Order template for Elite-Symmetry and Affinity 100mm doors "]
[]
[null,null,null,null,null,"and Microflush D660 frame"]
[]
[]
[]
[]
[]
[]
[]
[]
[]
[]
[]
[null,null,{"$f":"IF(lock_digit=1,\"\",IF( lock_digit=4,\"Height of deadlock thumb-turn from top of floor covering\",\"Height of handle from top of floor covering\"))","v":""}]
[null,null,"Left hand",null,{"$f":"frame_height_L-DimE_frame_L-strike_height-floor_covering","v":{"$error":"#N/A"}},"Right hand",null,{"$f":"frame_height_R-DimE_frame_R-strike_height-floor_covering","v":{"$error":"#N/A"}}]
[null,null,null,null,null,null,null,null,null,null,null,null,null,null,null,{"$f":"colour_code","v":2}]
[]
{"$rows_left_out":87}
{"sheet":"Frame","index":1,"n_rows":48,"n_cols":25,"rows_kept":48,"cut":false,"hidden":false,"merged":[[9,24,10,24],[46,7,46,12],[47,7,47,12],[9,17,10,22],[9,13,10,13],[9,23,10,23],[46,19,47,22],[46,13,47,15],[19,13,22,14],[19,15,22,16],[24,13,24,14],[24,15,24,16],[28,13,28,15],[29,13,29,15],[46,23,47,25],[46,16,47,18],[3,1,6,4],[9,9,10,12],[29,10,29,12],[28,10,28,12],[24,9,24,10],[24,11,24,12],[14,9,14,15],[18,9,18,10],[18,11,18,12],[18,13,18,14],[18,15,18,16],[15,9,15,12],[15,13,15,15],[27,9,27,15],[3,5,4,21],[5,5,6,21],[46,1,47,2],[46,3,47,3],[46,4,47,4],[18,17,18,19],[19,17,22,19],[24,17,24,19]]}
[]
[]
[]
[null,{"$f":"'Cover sheet'!B3","v":100091},null,null,null,"Order Template D660 Door Frame"]
[]
[null,null,null,null,null,{"$f":"\"Elite \" &door_type& \" with offset Pivots, \"& Lock_type","v":"Elite Symmetry with offset Pivots, No lock"}]
[]
[]
[]
[null,null,null,null,null,null,null,null,null,"Template number",null,null,null,"HAND","W","A","E","PART NUMBER",null,null,null,null,null,"QTY","Pattern charge"]
[null,null,null,null,null,null,null,null,null,null,null,null,null,null,"Width","Height","Lock"]
[null,null,null,null,null,null,null,null,null,{"$f":"R12&S12&T12","v":"1018"},{"$f":"'Cover sheet'!P19","v":2},{"$f":"CEILING(P12,100)","v":0},27,"LH",1094,0,{"$f":"DimE_std_L","v":{"$error":"#N/A"}},1,{"$f":"IF(door_lock>2,'Cover sheet'!$F$99-1,0)","v":0},{"$f":"INDEX(Lookups!$B$96:$F$97,2,door_lock)","v":18},{"$f":"colour_code","v":2},{"$f":"VLOOKUP(frame_height_L,frame_height_bands,3)","v":{"$error":"#N/A"}},{"$f":"27","v":27},0,{"$f":"IF(qty_frame_L>0,IF('Cover sheet'!$F$99>1,'Cover sheet'!$F$101,0),0)","v":0}]
[null,null,null,null,null,null,null,null,null,{"$f":"R13&S13&T13","v":"2018"},{"$f":"K12","v":2},{"$f":"CEILING(P13,100)","v":0},27,"RH",1094,0,{"$f":"DimE_std_R","v":{"$error":"#N/A"}},"2",{"$f":"IF(door_lock>2,'Cover sheet'!$G$99-1,0)","v":0},{"$f":"INDEX(Lookups!$B$96:$F$97,2,door_lock)","v":18},{"$f":"colour_code","v":2},{"$f":"VLOOKUP(frame_height_R,frame_height_bands,3)","v":{"$error":"#N/A"}},27,0,{"$f":"IF(qty_frame_R>0,IF('Cover sheet'!$G$99>1,'Cover sheet'!$F$101,0),0)","v":0}]
[]
[null,null,null,null,null,null,null,null,null,"FRAME COLOUR"]
[null,null,null,null,null,null,null,null,null,{"$f":"'Cover sheet'!$I$73","v":"Standard Grey / Silver"},null,null,null,{"$f":"K12","v":2}]
[]
[]
[null,null,null,null,null,null,null,null,null,"Jamb",null,"Head",null,"Pivot type",null,"Strike type",null,"Floor-spring Spindle"]
[null,null,null,null,null,null,null,null,null,null,null,null,null,"P6",null,{"$f":"HLOOKUP('Cover sheet'!D51,Lookups!B4:E7,4,FALSE)","v":"None"},null,{"$f":"VLOOKUP(floor_covering,spindle_table,2,FALSE)","v":"A"},null,null,null,null,"ü"]
{"$rows_left_out":29}
{"sheet":"Door","index":2,"n_rows":48,"n_cols":23,"rows_kept":48,"cut":false,"hidden":false,"merged":[[19,19,19,21],[14,20,14,21],[15,20,15,21],[27,11,27,12],[28,11,28,12],[24,9,24,12],[15,11,15,12],[18,9,19,12],[18,13,19,13],[25,9,26,9],[25,11,25,12],[26,11,26,12],[18,15,18,21],[19,15,19,18],[3,1,6,4],[12,9,13,12],[3,5,4,17],[5,5,6,17],[14,11,14,12],[12,13,13,13],[31,9,34,10],[46,19,47,22],[46,13,47,15],[46,1,47,2],[46,3,47,3],[46,4,47,4],[46,16,47,18],[46,10,47,12],[46,7,46,9],[47,7,47,9]]}
[]
[]
[]
[null,{"$f":"'Cover sheet'!B3","v":100091},null,null,null,{"$f":"\"Order Template for Elite \"& door_type& \" Double Glazed Door\"","v":"Order Template for Elite Symmetry Double Glazed Door"}]
[]
[null,null,null,null,null,{"$f":"\"Offset Pivots, \"& Lock_type","v":"Offset Pivots, No lock"}]
[]
[]
[null,null,null,null,null,null,null,null,null,"● To complete the template, input data into the BLUE highlighted sections of the tables below."]
[]
[]
[]
[null,null,null,null,null,null,null,null,null,"PART NUMBER",null,null,null,"HAND","W","A","F","G","E","QTY","LOW IRON GLASS"]
[null,null,null,null,null,null,null,null,null,null,null,null,null,null,"Width","Height","Handle Ht","Handle","Lock",null,"Yes or No"]
[null,null,null,null,null,null,null,null,null,{"$f":"MATCH(N15,Lookups!$A$16:$A$17,0)&LEFT(Lookups!$B$19,3)","v":"1153"},{"$f":"'Cover sheet'!P19","v":2},{"$f":"RIGHT(Lookups!$B$19,6)","v":"300061"},null,"LH",{"$f":"frame_width_L -frame_door_difference_width","v":1026},{"$f":"frame_height_L - frame_top-top_gap-bottom_gap-floor_covering","v":-24},null,null,{"$f":"DimE_frame_L-frame_top-top_gap","v":{"$error":"#N/A"}},{"$f":"qty_frame_L","v":0},"No"]
[null,null,null,null,null,null,null,null,null,{"$f":"MATCH(N16,Lookups!$A$16:$A$17,0)&LEFT(Lookups!$B$19,3)","v":"2153"},{"$f":"K15","v":2},{"$f":"RIGHT(Lookups!$B$19,6)","v":"300061"},null,"RH",{"$f":"frame_width_R -frame_door_difference_width","v":1026},{"$f":"frame_height_R - frame_top-top_gap-bottom_gap-floor_covering","v":-24},null,null,{"$f":"DimE_frame_R-frame_top-top_gap","v":{"$error":"#N/A"}},{"$f":"qty_frame_R","v":0},"No"]
[]
[null,null,null,null,null,null,null,null,null,"Internal Use Only"]
[null,null,null,null,null,null,null,null,null,"DOOR NUMBERS",null,null,null,"HAND",null,"FRAME COLOUR"]
[null,null,null,null,null,null,null,null,null,null,null,null,null,null,null,{"$f":"'Cover sheet'!$I$73","v":"Standard Grey / Silver"},null,null,null,{"$f":"'Cover sheet'!P19","v":2},null,null,"ü"]
{"$rows_left_out":29}
{"sheet":"Lookups","index":3,"n_rows":122,"n_cols":8,"rows_kept":122,"cut":false,"hidden":false,"merged":[[94,2,94,5]]}
[]
[null,"Leading stiles"]
[null,"No lock","Sash lock","Latch","Dead lock"]
["Henry's",1,2,3,4]
["Karen's",1,3,4,2]
[null,{"$f":"B3","v":"No lock"},{"$f":"C3","v":"Sash lock"},{"$f":"D3","v":"Latch"},{"$f":"E3","v":"Dead lock"}]
["Strike","None","K30","K29","K28"]
[]
["Karen's codes for doors"]
[]
[null,null,null,null,null,"Digit","Value","Comment"]
["Digits 3&4","Symmetry","Affinity",null,null,1,null,"LH or RH"]
[null,null,null,null,null,2,{"$f":"INDEX(B4:E5,2,lock_digit)","v":1},"Lock"]
["Double Glazed",53,55,null,null,"3 & 4",{"$f":"HLOOKUP('Cover sheet'!D50,Lookups!B12:C14,3,FALSE)","v":53}]
[null,null,null,null,null,"5 & 6",{"$f":"colour_offset","v":1},"Colour"]
["LH",1,null,null,null,7,3]
["RH",2,null,null,null,8,0]
[null,null,null,null,null,9,0]
["Part number",{"$f":"CONCATENATE(G13,G14,G15,G16,G17,G18,G19,G20,G21)","v":"1531300061"},null,"excludes LH/ RH digit",null,10,0]
[null,null,null,null,null,11,6]
{"$rows_left_out":103}
{"sheet":"LH Door Glass Order Sheet","index":4,"n_rows":48,"n_cols":20,"rows_kept":48,"cut":false,"hidden":false,"merged":[[3,1,6,4],[13,13,14,15],[13,16,14,16],[13,17,14,17],[15,10,15,12],[13,10,14,12],[5,5,6,17],[3,5,4,17],[9,13,11,18],[46,18,47,20],[47,7,47,9],[29,11,35,16],[46,1,47,2],[46,3,47,3],[46,4,47,4],[46,7,46,9],[46,10,47,11],[46,12,47,14],[46,15,47,17],[22,17,23,18],[13,18,14,18],[13,19,14,19],[20,17,21,18],[16,10,16,12]]}
[]
[]
[]
[null,{"$f":"'Cover sheet'!B3","v":100091},null,null,null,{"$f":"\"Glass prep order sheet for Elite \"& door_type& \" Double Glazed Door\"","v":"Glass prep order sheet for Elite Symmetry Double Glazed Door"}]
[]
[null,null,null,null,null,{"$f":"\"Offset Pivots, \"& Lock_type","v":"Offset Pivots, No lock"}]
[]
[]
[]
[null,null,null,null,null,null,null,null,null,null,null,null,null,"Left Hand door"]
[]
[]
[]
[null,null,null,null,null,null,null,null,null,null,"Type of glass",null,null,"PART NUMBER",null,null,"DIM `A`","DIM `W`",{"$f":"IF(door_type=\"Affinity\",\"\",\"DIM `F`\")","v":"DIM `F`"},{"$f":"IF(door_type=\"Affinity\",\"\",\"DIM `G`\")","v":"DIM `G`"}]
[]
[null,null,null,null,null,null,null,null,null,null,{"$f":"INDEX(glass_dimensions,7,MATCH(door_type,Lookups!$B$43:$C$43,0))","v":"8mm Toughened"},null,null,4000,{"$f":"Door!K21","v":0},61,{"$f":"door_height_L+INDEX(glass_dimensions,2,MATCH(door_type,Lookups!$B$43:$C$43,0))","v":-91},{"$f":"door_width_L+INDEX(glass_dimensions,3,MATCH(door_type,Lookups!$B$43:$C$43,0))","v":956},{"$f":"IF(door_type=\"Affinity\",\"\",Handle_Ht_L+INDEX(glass_dimensions,4,MATCH(door_type,Lookups!$B$43:$C$43,0)))","v":-32},{"$f":"IF(door_type=\"Affinity\",\"\",Handle_pitch_L)","v":0}]
[null,null,null,null,null,null,null,null,null,null,{"$f":"INDEX(glass_dimensions,6,MATCH(door_type,Lookups!$B$43:$C$43,0))","v":"6mm Toughened"},null,null,5000,{"$f":"Door!K21","v":0},61,{"$f":"Q16","v":-91},{"$f":"R16","v":956},{"$f":"S16","v":-32},{"$f":"T16","v":0}]
[]
[]
[]
{"$rows_left_out":29}
{"sheet":"RH Door Glass Order Sheet","index":5,"n_rows":48,"n_cols":20,"rows_kept":48,"cut":false,"hidden":false,"merged":[[3,1,6,4],[13,13,14,15],[13,16,14,16],[13,17,14,17],[15,10,15,12],[13,10,14,12],[5,5,6,17],[3,5,4,17],[9,13,11,18],[46,18,47,20],[47,7,47,9],[29,11,35,16],[46,1,47,2],[46,3,47,3],[46,4,47,4],[46,7,46,9],[46,10,47,11],[46,12,47,14],[46,15,47,17],[22,17,23,18],[13,18,14,18],[13,19,14,19],[20,17,21,18],[16,10,16,12]]}
[]
[]
[]
[null,{"$f":"'Cover sheet'!B3","v":100091},null,null,null,{"$f":"\"Glass prep order sheet for Elite \"& door_type& \" Double Glazed Door\"","v":"Glass prep order sheet for Elite Symmetry Double Glazed Door"}]
[]
[null,null,null,null,null,{"$f":"\"Offset Pivots, \"& Lock_type","v":"Offset Pivots, No lock"}]
[]
[]
[]
[null,null,null,null,null,null,null,null,null,null,null,null,null,"Right Hand door"]
[]
[]
[]
[null,null,null,null,null,null,null,null,null,null,"Type of glass",null,null,"PART NUMBER",null,null,"DIM `A`","DIM `W`",{"$f":"IF(door_type=\"Affinity\",\"\",\"DIM `F`\")","v":"DIM `F`"},{"$f":"IF(door_type=\"Affinity\",\"\",\"DIM `G`\")","v":"DIM `G`"}]
[]
[null,null,null,null,null,null,null,null,null,null,{"$f":"INDEX(glass_dimensions,7,MATCH(door_type,Lookups!$B$43:$C$43,0))","v":"8mm Toughened"},null,null,4000,{"$f":"Door!K22","v":0},61,{"$f":"door_height_R+INDEX(glass_dimensions,2,MATCH(door_type,Lookups!$B$43:$C$43,0))","v":-91},{"$f":"door_width_L+INDEX(glass_dimensions,3,MATCH(door_type,Lookups!$B$43:$C$43,0))","v":956},{"$f":"IF(door_type=\"Affinity\",\"\",Handle_Ht_R+INDEX(glass_dimensions,4,MATCH(door_type,Lookups!$B$43:$C$43,0)))","v":-32},{"$f":"IF(door_type=\"Affinity\",\"\",handle_pitch_R)","v":0}]
[null,null,null,null,null,null,null,null,null,null,{"$f":"INDEX(glass_dimensions,6,MATCH(door_type,Lookups!$B$43:$C$43,0))","v":"6mm Toughened"},null,null,5000,{"$f":"Door!K22","v":0},61,{"$f":"Q16","v":-91},{"$f":"R16","v":956},{"$f":"S16","v":-32},{"$f":"T16","v":0}]
[]
[]
[]
{"$rows_left_out":29}
{"sheet":"LH Cutting List","index":6,"n_rows":42,"n_cols":20,"rows_kept":42,"cut":false,"hidden":false,"merged":[[3,1,6,5],[3,6,4,17],[13,2,14,5],[13,6,14,6],[13,7,14,7],[13,8,14,8],[13,9,14,11],[13,12,15,17],[17,12,17,14],[17,15,17,16],[5,6,6,18],[17,18,17,19],[18,2,19,5],[18,6,19,8],[18,9,19,11],[18,12,19,14],[18,15,19,17],[18,18,19,20],[21,2,21,5],[21,6,21,8],[21,9,21,11],[21,12,21,14],[21,15,21,17],[21,18,21,20],[20,2,20,5],[20,6,20,8],[20,9,20,11],[20,12,20,14],[20,15,20,17],[20,18,20,20],[23,18,23,20],[22,2,22,5],[22,6,22,8],[22,9,22,11],[22,12,22,14],[22,15,22,17],[22,18,22,20],[25,2,25,5],[25,6,25,8],[25,9,25,11],[25,12,25,14],[25,15,25,17],[25,18,25,20],[24,2,24,5],[24,6,24,8],[24,9,24,11],[24,12,24,14],[24,15,24,17],[24,18,24,20],[23,2,23,5],[23,6,23,8],[23,9,23,11],[23,12,23,14],[23,15,23,17],[27,18,27,20],[26,2,26,5],[26,6,26,8],[26,9,26,11],[26,12,26,14],[26,15,26,17],[26,18,26,20],[29,2,29,5],[29,6,29,8],[29,9,29,11],[29,12,29,14],[29,15,29,17],[29,18,29,20],[28,2,28,5],[28,6,28,8],[28,9,28,11],[28,12,28,14],[28,15,28,17],[28,18,28,20],[27,2,27,5],[27,6,27,8],[27,9,27,11],[27,12,27,14],[27,15,27,17],[34,2,34,5],[34,6,34,8],[34,9,34,11],[30,2,30,5],[30,6,30,8],[30,9,30,11],[30,12,30,14],[30,15,30,17],[30,18,30,20],[31,2,31,5],[31,6,31,8],[31,9,31,11],[31,12,31,14],[31,15,31,17],[31,18,31,20],[33,2,33,5],[33,6,33,8],[33,9,33,11],[33,12,33,14],[33,15,33,17],[33,18,33,20],[32,2,32,5],[32,6,32,8],[32,9,32,11],[32,12,32,14],[32,15,32,17],[32,18,32,20],[34,12,34,14],[34,15,34,17],[34,18,34,20],[35,12,35,14],[35,15,35,17],[35,18,35,20],[35,2,35,5],[35,6,35,8],[35,9,35,11],[36,2,36,5],[40,16,41,18],[40,19,41,21],[41,8,41,10],[39,13,39,14],[40,1,41,2],[40,3,41,3],[40,5,41,5],[40,8,40,10],[40,11,41,12],[40,13,41,15],[36,6,36,8],[36,9,36,11],[36,12,36,14],[36,15,36,17]]}
[]
[]
[]
[null,{"$f":"'Cover sheet'!B3","v":100091},null,null,null,null,{"$f":"\"Cutting/Machining List for Elite \" &door_type","v":"Cutting/Machining List for Elite Symmetry"}]
[]
[null,null,null,null,null,null,{"$f":"\"Offset Pivots, \"& Lock_type","v":"Offset Pivots, No lock"}]
[]
[]
[]
[]
[]
[]
[]
[null,null,"FRAME PART NUMBER",null,null,null,"HAND","QTY",null,"O/A FRAME SIZE",null,null,"LEFT HAND DOOR"]
[]
[null,null,1000,{"$f":"Door!K21","v":0},{"$f":"Door!L21","v":2},61,"L/H",{"$f":"Door!T15","v":0},null,{"$f":"Door!O15","v":1026},"X",{"$f":"Door!P15","v":-24}]
[]
[]
[null,null,"LH FRAME COMPONENT SCHEDULE",null,null,null,"MATERIAL",null,null,"DRAWING",null,null,"CUTTING LENGTH",null,null,"MACRO 'DIM E'",null,null,"QTY REQUIRED"]
[]
{"$rows_left_out":23}
{"sheet":"RH Cutting List","index":7,"n_rows":42,"n_cols":20,"rows_kept":42,"cut":false,"hidden":false,"merged":[[36,9,36,11],[36,12,36,14],[36,15,36,17],[18,2,19,5],[18,6,19,8],[18,9,19,11],[18,12,19,14],[18,15,19,17],[18,18,19,20],[21,2,21,5],[21,6,21,8],[21,9,21,11],[21,12,21,14],[21,15,21,17],[21,18,21,20],[20,2,20,5],[20,6,20,8],[20,9,20,11],[20,12,20,14],[20,15,20,17],[20,18,20,20],[23,2,23,5],[23,6,23,8],[23,9,23,11],[3,1,6,5],[3,6,4,17],[13,2,14,5],[13,6,14,6],[13,7,14,7],[13,8,14,8],[13,9,14,11],[13,12,15,17],[5,6,6,18],[23,12,23,14],[23,15,23,17],[23,18,23,20],[22,2,22,5],[22,6,22,8],[22,9,22,11],[22,12,22,14],[22,15,22,17],[22,18,22,20],[25,2,25,5],[25,6,25,8],[25,9,25,11],[25,12,25,14],[25,15,25,17],[25,18,25,20],[24,2,24,5],[24,6,24,8],[24,9,24,11],[24,12,24,14],[24,15,24,17],[24,18,24,20],[27,2,27,5],[27,6,27,8],[27,9,27,11],[27,12,27,14],[27,15,27,17],[27,18,27,20],[26,2,26,5],[26,6,26,8],[26,9,26,11],[26,12,26,14],[26,15,26,17],[26,18,26,20],[29,2,29,5],[29,6,29,8],[29,9,29,11],[29,12,29,14],[29,15,29,17],[29,18,29,20],[28,2,28,5],[28,6,28,8],[28,9,28,11],[28,12,28,14],[28,15,28,17],[28,18,28,20],[31,2,31,5],[31,6,31,8],[31,9,31,11],[31,12,31,14],[31,15,31,17],[31,18,31,20],[30,2,30,5],[30,6,30,8],[30,9,30,11],[30,12,30,14],[30,15,30,17],[30,18,30,20],[33,2,33,5],[33,6,33,8],[33,9,33,11],[33,12,33,14],[33,15,33,17],[33,18,33,20],[32,2,32,5],[32,6,32,8],[32,9,32,11],[32,12,32,14],[32,15,32,17],[32,18,32,20],[34,2,34,5],[34,6,34,8],[34,9,34,11],[34,12,34,14],[34,15,34,17],[34,18,34,20],[40,16,41,18],[40,19,41,21],[41,8,41,10],[39,13,39,14],[40,1,41,2],[40,3,41,3],[40,5,41,5],[40,8,40,10],[40,11,41,12],[40,13,41,15],[35,2,35,5],[35,6,35,8],[35,9,35,11],[35,12,35,14],[35,15,35,17],[35,18,35,20],[36,2,36,5],[36,6,36,8]]}
[]
[]
[]
[null,{"$f":"'Cover sheet'!B3","v":100091},null,null,null,null,{"$f":"\"Cutting/Machining List for Elite \" &door_type","v":"Cutting/Machining List for Elite Symmetry"}]
[]
[null,null,null,null,null,null,{"$f":"\"Offset Pivots, \"& Lock_type","v":"Offset Pivots, No lock"}]
[]
[]
[]
[]
[]
[]
[]
[null,null,"FRAME PART NUMBER",null,null,null,"HAND","QTY",null,"O/A FRAME SIZE",null,null,"RIGHT HAND DOOR"]
[]
[null,null,1000,{"$f":"Door!K22","v":0},{"$f":"Door!L22","v":2},61,"R/H",{"$f":"Door!T16","v":0},null,{"$f":"Door!O16","v":1026},"X",{"$f":"Door!P16","v":-24}]
[]
[]
[null,null,"RH FRAME COMPONENT SCHEDULE",null,null,null,"MATERIAL",null,null,"DRAWING",null,null,"CUTTING LENGTH",null,null,"MACRO 'DIM E'",null,null,"QTY REQUIRED"]
[]
{"$rows_left_out":23}
{"sheet":"Frame Cutting List","index":8,"n_rows":42,"n_cols":20,"rows_kept":42,"cut":false,"hidden":false,"merged":[[3,1,6,5],[3,6,4,17],[5,6,6,17],[26,2,27,5],[26,6,27,6],[26,7,27,9],[26,10,27,10],[11,2,12,5],[11,6,12,6],[11,7,12,9],[11,10,12,10],[15,12,15,14],[15,15,15,16],[18,6,18,8],[18,9,18,11],[21,12,21,14],[21,15,21,17],[32,18,32,20],[30,2,31,5],[30,6,31,8],[30,9,31,11],[30,12,31,14],[30,15,31,17],[30,18,31,20],[32,12,32,14],[32,15,32,17],[32,2,32,5],[32,6,32,8],[32,9,32,11],[36,12,36,14],[36,15,36,17],[37,2,37,5],[37,6,37,8],[37,9,37,11],[37,12,37,14],[37,15,37,17],[34,18,34,20],[33,18,33,20],[34,2,34,5],[34,6,34,8],[34,9,34,11],[34,12,34,14],[34,15,34,17],[33,2,33,5],[33,6,33,8],[33,9,33,11],[33,12,33,14],[33,15,33,17],[40,16,41,18],[40,19,41,21],[41,8,41,10],[40,1,41,2],[40,3,41,4],[40,5,41,5],[40,8,40,10],[40,11,41,12],[40,13,41,15],[15,18,15,19],[16,2,17,5],[16,6,17,8],[16,9,17,11],[16,12,17,14],[16,15,17,17],[16,18,17,20],[37,18,37,20],[38,2,38,5],[38,6,38,8],[38,9,38,11],[38,12,38,14],[38,15,38,17],[38,18,38,20],[36,18,36,20],[35,2,35,5],[35,6,35,8],[35,9,35,11],[35,12,35,14],[35,15,35,17],[35,18,35,20],[36,2,36,5],[36,6,36,8],[36,9,36,11],[21,18,21,20],[20,2,20,5],[20,6,20,8],[20,9,20,11],[20,12,20,14],[20,15,20,17],[18,12,18,14],[18,15,18,17],[18,18,18,20],[19,2,19,5],[19,6,19,8],[19,9,19,11],[19,12,19,14],[19,15,19,17],[19,18,19,20],[18,2,18,5],[24,18,24,20],[11,11,13,20],[26,11,28,20],[24,2,24,5],[24,6,24,8],[24,9,24,11],[24,12,24,14],[24,15,24,17],[22,18,22,20],[23,2,23,5],[23,6,23,8],[23,9,23,11],[23,12,23,14],[23,15,23,17],[23,18,23,20],[22,2,22,5],[22,6,22,8],[22,9,22,11],[22,12,22,14],[22,15,22,17],[20,18,20,20],[21,2,21,5],[21,6,21,8],[21,9,21,11]]}
[]
[]
[]
[null,{"$f":"'Cover sheet'!B3","v":100091},null,null,null,null,"Cutting/Machining List D660 Door Frame"]
[]
[null,null,null,null,null,null,{"$f":"Frame!F6","v":"Elite Symmetry with offset Pivots, No lock"}]
[]
[]
[]
[]
[]
[null,null,"FRAME PART NUMBER",null,null,null,"HAND","O/A FRAME SIZE",null,null,"QTY","LEFT HAND DOOR FRAME"]
[]
[null,null,{"$f":"Frame!$J$12","v":"1018"},{"$f":"Frame!$K$12","v":2},{"$f":"Frame!$L$12","v":0},{"$f":"Frame!$M$12","v":27},"LH",{"$f":"Frame!$O$12","v":1094},"X",{"$f":"Frame!$L$12","v":0},{"$f":"Frame!$X$12","v":0}]
[]
[]
[null,null,"FRAME COMPONENT SCHEDULE",null,null,null,"MATERIAL",null,null,"DRAWING",null,null,"CUTTING LENGTH",null,null,"DIM  E",null,null,"QTY REQUIRED"]
[]
[]
[null,null,"Jamb Pivot Side ",null,null,null,{"$f":"LEFT(J20,4)&\" (\"&LEFT(J20,4)&\"09310003)\"","v":"0440 (044009310003)"},null,null,{"$f":"HLOOKUP(door_lock,'Drawing Numbers'!$E$46:$I$65,3)","v":"0440-001"},null,null,{"$f":"$J$14+50","v":50},null,null,null,null,null,{"$f":"$K$14","v":0}]
{"$rows_left_out":23}
{"sheet":"Drawing Numbers","index":9,"n_rows":65,"n_cols":9,"rows_kept":65,"cut":false,"hidden":false,"merged":[[64,0,64,3],[65,0,65,3],[57,0,58,3],[59,0,59,3],[60,0,60,3],[61,0,61,3],[62,0,62,3],[63,0,63,3],[49,0,49,3],[50,0,50,3],[51,0,51,3],[52,0,52,3],[39,0,39,3],[44,0,45,3],[46,0,46,3],[47,0,47,3],[48,0,48,3],[41,0,41,8],[36,0,36,3],[37,0,37,3],[38,0,38,3],[33,0,33,3],[26,0,26,3],[28,0,28,3],[34,0,34,3],[35,0,35,3],[24,0,24,3],[11,0,11,3],[0,0,2,8],[13,0,13,3],[15,0,15,3],[17,0,17,3],[19,0,19,3],[22,0,22,3],[12,0,12,3],[23,0,23,3],[4,0,4,8],[5,0,5,8]]}
["Drawing numbers"]
[]
[]
[]
["Doors"]
[]
[null,null,null,null,"Symmetry","Affinity","Affinity","Affinity","Affinity"]
[null,null,null,null,"No lock","No lock","Sash lock","latch","Dead lock"]
[null,null,null,null,1,2,3,4,5]
["LH FRAME COMPONENT SCHEDULE",null,null,null,"DRAWING","DRAWING","DRAWING","DRAWING","DRAWING"]
[]
["Leading Stile",null,null,null,"0423-002","0425-007","0425-001","0425-003","0425-005"]
[]
["Fixed (pivoted) Stile",null,null,null,"0423-003","0423-003","0423-003","0423-003","0423-003"]
[]
["Head Rail",null,null,null,"0423-001","0423-007","0423-007","0423-007","0423-007"]
[]
["Base Rail",null,null,null,"0424-001","0424-003","0424-003","0424-003","0424-003"]
[]
[]
{"$rows_left_out":46}
{"sheet":"Images","index":10,"n_rows":251,"n_cols":22,"rows_kept":251,"cut":false,"hidden":true,"merged":[]}
[]
[]
[]
[]
[]
[]
[]
[]
[]
[]
[]
[null,null,null,null,null,null,null,null,null,null,null,null,null,null,"Left hand glass",null,null,null,null,null,null,"Right hand glass"]
[]
[]
[]
[]
[]
[]
[]
[]
{"$rows_left_out":232}
{"sheet":"Change record","index":11,"n_rows":41,"n_cols":4,"rows_kept":41,"cut":false,"hidden":false,"merged":[]}
["Latest",{"$f":"INDEX(B3:B301,D1,1)","v":"Version 9.1"},null,{"$f":"IF(ISERROR(MATCH(9E+99+306,B3:B301)),MATCH(\"*\",B3:B301,-1))","v":39}]
[]
["2015-07-14","Version 1","First draft.  Single glazed only; DG disabled","For checking by Dave Webb"]
["2015-08-04","Version 2","Following review by Dave Webb"]
[null,null,"Instructions on frame sheet removed"]
[null,null,"Removal of door-only and frame-only options (unlikely to be needed)"]
[null,null,"Linking of customer details on door and frame sheets to the Cover sheet inputs"]
[null,null,"Addition of \"Corridor view\" dimensions"]
[null,null,"Combination of frame cutting lsits onto one sheet (in line with the Edge doors)"]
[null,null,"Addition of printing macros"]
[null,null,"Constraint added on width (max 1094mm, min 900mm) of frame"]
["2015-10-21","Version 3","Change to strike height - varies by lock type (dead lock is < sash and latch)"]
[null,null,"Update of printing macros"]
[null,null,"Initiation of handle heights depending on whether pull handles are needed"]
[null,null,"Bottom gap increased to 7mm"]
[null,null,"Strike plates awaiting names / codes"]
[null,null,"Title blocks on frame cutting sheet corrected"]
[null,null,"Hide lock Dims when no lock is required"]
["2015-11-13","Version 4","Strike plates names added"]
[null,null,"Bespoke option added"]
{"$rows_left_out":21}